Target
Adenosine receptor A2a
Ligand
BDBM50004461
Substrate
Ki
6.4±n/a nM
Comments
PDSP_2452
Citation
 Klotz, KNCamaioni, EVolpini, RKachler, SVittori, SCristalli, G 2-Substituted N-ethylcarboxamidoadenosine derivatives as high-affinity agonists at human A3 adenosine receptors. Naunyn Schmiedebergs Arch Pharmacol 360:103-8 (1999)  
Target
Name:
Adenosine receptor A2a
Synonyms:
A2A adenosine receptor (hA2A) ADENOSINE A2 ADORA2 Adenosine A2A receptor (A2AAR)
Type:
G Protein-Coupled Receptor (GPCR)
Mol. Mass.:
44716.46
Organism:
Homo sapiens (Human)
Description:
P29274
Residue:
412
  
Inhibitor
Name:
BDBM50004461
Synonyms:
(2S,3R,5R)-5-[6-amino-2-(hex-1-yn-1-yl)-9H-purin-9-yl]-N-ethyl-3,4-dihydroxyoxolane-2-carboxamide 5-(6-Amino-2-hex-1-ynyl-purin-9-yl)-3,4-dihydroxy-tetrahydro-furan-2-carboxylic acid ethylamide HENECA
Type:
Small organic molecule
Emp. Form.:
C18H24N6O4
Mol. Mass.:
388.421
SMILES:
CCCCC#Cc1nc(N)c2ncn([C@@H]3O[C@@H]([C@H](O)C3O)C(=O)NCC)c2n1
: