Target
Adenosine receptor A2a
Ligand
BDBM50041912
Substrate
Ki
56±n/a nM
Comments
PDSP_191
Citation
 Klotz, KNCamaioni, EVolpini, RKachler, SVittori, SCristalli, G 2-Substituted N-ethylcarboxamidoadenosine derivatives as high-affinity agonists at human A3 adenosine receptors. Naunyn Schmiedebergs Arch Pharmacol 360:103-8 (1999)  
Target
Name:
Adenosine receptor A2a
Synonyms:
A2A adenosine receptor (hA2A) ADENOSINE A2 ADORA2 Adenosine A2A receptor (A2AAR)
Type:
G Protein-Coupled Receptor (GPCR)
Mol. Mass.:
44716.46
Organism:
Homo sapiens (Human)
Description:
P29274
Residue:
412
  
Inhibitor
Name:
BDBM50041912
Synonyms:
2-substituted NECA derivatives, 7 | 5-[6-Amino-2-(3-hydroxy-3-phenyl-but-1-ynyl)-purin-9-yl]-3,4-dihydroxy-tetrahydro-furan-2-carboxylic acid ethylamide
Type:
Small organic molecule
Emp. Form.:
C22H24N6O5
Mol. Mass.:
452.4632
SMILES:
CCNC(=O)C1OC(C(O)C1O)n1cnc2c(N)nc(nc12)C#CC(C)(O)c1ccccc1
: