Target
Neuropeptide Y receptor type 1
Ligand
BDBM82285
Substrate
Ki
260±n/a nM
Comments
PDSP_2992
Citation
 Berglund, MMHolmberg, SKEriksson, HGedda, KMaffrand, JPSerradeil-Le Gal, CChhajlani, VGrundemar, LLarhammar, D The cloned guinea pig neuropeptide Y receptor Y1 conforms to other mammalian Y1 receptors. Peptides 20:1043-53 (1999)  
Target
Name:
Neuropeptide Y receptor type 1
Synonyms:
NPY-Y1 NPY1R_CAVPO
Type:
Enzyme Catalytic Domain
Mol. Mass.:
44288.14
Organism:
GUINEA PIG
Description:
NPY-Y1 NPY1R GUINEA PIG::Q9WVD0
Residue:
383
  
Inhibitor
Name:
BDBM82285
Synonyms:
NPY 18-36 NPY18-36, porcine
Type:
Small organic molecule
Emp. Form.:
C112H174N36O27
Mol. Mass.:
2456.805
SMILES:
CC[C@H](C)[C@H](NC(=O)[C@H](Cc1ccc(O)cc1)NC(=O)[C@H](Cc1cnc[nH]1)NC(=O)[C@H](CCCN=C(N)N)NC(=O)[C@H](CC(C)C)NC(=O)[C@H](C)NC(=O)[C@H](CO)NC(=O)[C@H](Cc1ccc(O)cc1)NC(=O)[C@H](Cc1ccc(O)cc1)NC(=O)[C@H](CCCN=C(N)N)NC(=O)[C@H](C)N)C(=O)N[C@@H](CC(N)=O)C(=O)N[C@@H](CC(C)C)C(=O)N[C@@H]([C@@H](C)CC)C(=O)N[C@@H]([C@@H](C)O)C(=O)N[C@@H](CCCN=C(N)N)C(=O)N[C@@H](CCC(N)=O)C(=O)N[C@@H](CCCN=C(N)N)C(=O)N[C@@H](Cc1ccc(O)cc1)C(N)=O
: