Target
Angiotensin-converting enzyme 2
Ligand
BDBM85558
Substrate
Ki
8.49±n/a nM
Comments
PDSP_309
Citation
 Handa, RKHarding, JWSimasko, SM Characterization and function of the bovine kidney epithelial angiotensin receptor subtype 4 using angiotensin IV and divalinal angiotensin IV as receptor ligands. J Pharmacol Exp Ther 291:1242-9 (1999) Target
Name:
Angiotensin-converting enzyme 2
Synonyms:
ACE2 Angiotensin IV
Type:
Enzyme Catalytic Domain
Mol. Mass.:
93046.63
Organism:
BOVINE
Description:
Angiotensin IV 0 BOVINE::Q58DD0
Residue:
804
  
Inhibitor
Name:
BDBM85558
Synonyms:
Ang IV Nor1
Type:
Small organic molecule
Emp. Form.:
C39H52N8O8
Mol. Mass.:
760.879
SMILES:
CC[C@H](C)[C@H](NC(=O)[C@H](Cc1ccc(O)cc1)NC(=O)CCCN)C(=O)N[C@@H](Cc1cnc[nH]1)C(=O)N1CCC[C@H]1C(=O)N[C@@H](Cc1ccccc1)C(O)=O
: