Target
Angiotensin-converting enzyme 2
Ligand
BDBM85553
Substrate
Ki
10.5±n/a nM
Comments
PDSP_318
Citation
 Handa, RKHarding, JWSimasko, SM Characterization and function of the bovine kidney epithelial angiotensin receptor subtype 4 using angiotensin IV and divalinal angiotensin IV as receptor ligands. J Pharmacol Exp Ther 291:1242-9 (1999) Target
Name:
Angiotensin-converting enzyme 2
Synonyms:
ACE2 Angiotensin IV
Type:
Enzyme Catalytic Domain
Mol. Mass.:
93046.63
Organism:
BOVINE
Description:
Angiotensin IV 0 BOVINE::Q58DD0
Residue:
804
  
Inhibitor
Name:
BDBM85553
Synonyms:
Ang(3-7)
Type:
Small organic molecule
Emp. Form.:
C31H45N7O7
Mol. Mass.:
627.7317
SMILES:
CC[C@H](C)[C@H](NC(=O)[C@H](Cc1ccc(O)cc1)NC(=O)[C@@H](N)C(C)C)C(=O)N[C@@H](Cc1cnc[nH]1)C(=O)N1CCC[C@H]1C(O)=O
: