Target
Somatostatin receptor type 4
Ligand
BDBM82456
Substrate
Ki
1047.12±n/a nM
Comments
PDSP_376
Citation
 Siehler, SSeuwen, KHoyer, D Characterisation of human recombinant somatostatin receptors. 1. Radioligand binding studies. Naunyn Schmiedebergs Arch Pharmacol 360:488-99 (1999)  
Target
Name:
Somatostatin receptor type 4
Synonyms:
SOMATOSTATIN SST4 SS4-R SSR4_HUMAN SSTR4 | Somatostatin receptor type 4 (SSTR4)
Type:
Enzyme
Mol. Mass.:
42015.38
Organism:
Homo sapiens (Human)
Description:
P31391
Residue:
388
  
Inhibitor
Name:
BDBM82456
Synonyms:
BIM 23030 | CAS_117580-24-2
Type:
Small organic molecule
Emp. Form.:
C45H57N9O8S2
Mol. Mass.:
916.12
SMILES:
CC(C)[C@@H]1NC(=O)[C@H](CCCCN)NC(=O)[C@@H](Cc2c[nH]c3ccccc23)NC(=O)[C@H](Cc2ccc(O)cc2)NC(=O)CCSSC(NC1=O)C(=O)N[C@@H](Cc1ccccc1)C(N)=O
: