Target
Somatostatin receptor type 4
Ligand
BDBM82460
Substrate
Ki
0.87±n/a nM
Comments
PDSP_1763
Citation
 Siehler, SSeuwen, KHoyer, D Characterisation of human recombinant somatostatin receptors. 1. Radioligand binding studies. Naunyn Schmiedebergs Arch Pharmacol 360:488-99 (1999)  
Target
Name:
Somatostatin receptor type 4
Synonyms:
SOMATOSTATIN SST4 SS4-R SSR4_HUMAN SSTR4 | Somatostatin receptor type 4 (SSTR4)
Type:
Enzyme
Mol. Mass.:
42015.38
Organism:
Homo sapiens (Human)
Description:
P31391
Residue:
388
  
Inhibitor
Name:
BDBM82460
Synonyms:
L-Ser-L-Ala-L-Asn-L-Ser-L-Asn-L-Pro-L-Ala-L-Met-L-Ala-L-Pro-L-Arg-L-Glu-L-Arg-L-Lys-L-Ala-Gly-L-Cys(1)-L-Lys-L-Asn-L-Phe-L-Phe-L-Trp-L-Lys-L-Thr-L-Phe-L-Thr-L-Ser-L-Cys(1)-OH | somatostatin-28
Type:
Small organic molecule
Emp. Form.:
C137H207N41O39S3
Mol. Mass.:
3148.556
SMILES:
CSCCC(NC(=O)C(C)NC(=O)C1CCCN1C(=O)C(CC(N)=O)NC(=O)C(CO)NC(=O)C(CC(N)=O)NC(=O)C(C)NC(=O)C(N)CO)C(=O)NC(C)C(=O)N1CCC[C@H]1C(=O)NC(CCCN=C(N)N)C(=O)NC(CCC(O)=O)C(=O)NC(CCCN=C(N)N)C(=O)NC(CCCCN)C(=O)NC(C)C(=O)NCC(=O)N[C@H]1CSSC[C@@H](NC(=O)[C@@H](CO)NC(=O)[C@H](NC(=O)[C@@H](Cc2ccccc2)NC(=O)[C@@H](NC(=O)C(CCCCN)NC(=O)[C@@H](Cc2c[nH]c3ccccc23)NC(=O)C(Cc2ccccc2)NC(=O)C(Cc2ccccc2)NC(=O)C(CC(N)=O)NC(=O)C(CCCCN)NC1=O)[C@H](C)O)[C@H](C)O)C(O)=O
: