Target
Xanthine dehydrogenase/oxidase
Ligand
BDBM85578
Substrate
Meas. Tech.
Inhibition Assay
pH
7.8±0
Temperature
298.15±0 K
IC50
1.696e+4± 8.5e+2 nM
Citation
 Fernandes, ECarvalho, FSilva, AMSantos, CMPinto, DCCavaleiro, JABastos, Mde L 2-styrylchromones as novel inhibitors of xanthine oxidase. A structure-activity study. J Enzyme Inhib Med Chem 17:45-8 (2002)  
Target
Name:
Xanthine dehydrogenase/oxidase
Synonyms:
XD XDHA XO Xanthine dehydrogenase/oxidase | Xanthine oxidase
Type:
Enzyme
Mol. Mass.:
146441.21
Organism:
Homo sapiens (Human)
Description:
P47989
Residue:
1333
  
Inhibitor
Name:
BDBM85578
Synonyms:
2-Styrylchromone derivate, 1c
Type:
Small organic molecule
Emp. Form.:
C17H12O3
Mol. Mass.:
264.2754
SMILES:
Oc1ccc2c(c1)oc(\C=C\c1ccccc1)cc2=O
: