Target
Xanthine dehydrogenase/oxidase
Ligand
BDBM85579
Substrate
Meas. Tech.
Inhibition Assay
pH
7.8±0
Temperature
298.15±0 K
IC50
2.52e+3± 8e+1 nM
Citation
 Fernandes, ECarvalho, FSilva, AMSantos, CMPinto, DCCavaleiro, JABastos, Mde L 2-styrylchromones as novel inhibitors of xanthine oxidase. A structure-activity study. J Enzyme Inhib Med Chem 17:45-8 (2002)  
Target
Name:
Xanthine dehydrogenase/oxidase
Synonyms:
XD XDHA XO Xanthine dehydrogenase/oxidase | Xanthine oxidase
Type:
Enzyme
Mol. Mass.:
146441.21
Organism:
Homo sapiens (Human)
Description:
P47989
Residue:
1333
  
Inhibitor
Name:
BDBM85579
Synonyms:
2-Styrylchromone derivate, 1d
Type:
Small organic molecule
Emp. Form.:
C17H12O4
Mol. Mass.:
280.2748
SMILES:
Oc1cc(O)c2c(c1)oc(C=Cc1ccccc1)cc2=O
: