Target
5-hydroxytryptamine receptor 1D
Ligand
BDBM85595
Substrate
Ki
1000±n/a nM
Comments
PDSP_833
Citation
 Millan, MJNewman-Tancredi, AAudinot, VCussac, DLejeune, FNicolas, JPCogé, FGalizzi, JPBoutin, JARivet, JMDekeyne, AGobert, A Agonist and antagonist actions of yohimbine as compared to fluparoxan at alpha(2)-adrenergic receptors (AR)s, serotonin (5-HT)(1A), 5-HT(1B), 5-HT(1D) and dopamine D(2) and D(3) receptors. Significance for the modulation of frontocortical monoaminergic transmission and depressive states. Synapse 35:79-95 (2000)  
Target
Name:
5-hydroxytryptamine receptor 1D
Synonyms:
5-HT-1D 5-HT1D 5HT1D_HUMAN HTR1DA Serotonin (5-HT) receptor | Serotonin Receptor 1D
Type:
G Protein-Coupled Receptor (GPCR)
Mol. Mass.:
41920.63
Organism:
Homo sapiens (Human)
Description:
Receptor binding assays were performed using human clone stably expressed in CHO cells.
Residue:
377
  
Inhibitor
Name:
BDBM85595
Synonyms:
CAS_105182-45-4 NSC_72036
Type:
Small organic molecule
Emp. Form.:
C10H10FNO2
Mol. Mass.:
195.1903
SMILES:
Fc1cccc2OC3CNCC3Oc12
: