Target
5-hydroxytryptamine receptor 2A
Ligand
BDBM50005265
Substrate
Ki
306±n/a nM
Comments
PDSP_722
Citation
 Egan, CGrinde, EDupre, ARoth, BLHake, MTeitler, MHerrick-Davis, K Agonist high and low affinity state ratios predict drug intrinsic activity and a revised ternary complex mechanism at serotonin 5-HT(2A) and 5-HT(2C) receptors. Synapse 35:144-50 (2000)  
Target
Name:
5-hydroxytryptamine receptor 2A
Synonyms:
5-HT-2 5-HT2A 5-hydroxytryptamine receptor 2A (5HT-2A) 5HT2A_HUMAN HTR2A | Serotonin receptor 2A
Type:
undefined
Mol. Mass.:
52607.65
Organism:
Homo sapiens (Human)
Description:
P28223
Residue:
471
  
Inhibitor
Name:
BDBM50005265
Synonyms:
(+/-)2-(2,5-Dimethoxy-4-methyl-phenyl)-1-methyl-ethylamine (Rec)2-(2,5-Dimethoxy-4-methyl-phenyl)-1-methyl-ethylamine; compound with 2-(2,5-dimethoxy-4-methyl-phenyl)-1-methyl-ethylamine 2-(2,5-Dimethoxy-4-methyl-phenyl)-1-methyl-ethylamine((R)-(-)-DOM) CHEMBL8600 DOM,R(-) | Racemic DOM
Type:
Small organic molecule
Emp. Form.:
C12H19NO2
Mol. Mass.:
209.2848
SMILES:
COc1cc(CC(C)N)c(OC)cc1C
: