Target
5-hydroxytryptamine receptor 2A
Ligand
BDBM50001915
Substrate
Ki
212±n/a nM
Comments
PDSP_1168
Citation
 Egan, CGrinde, EDupre, ARoth, BLHake, MTeitler, MHerrick-Davis, K Agonist high and low affinity state ratios predict drug intrinsic activity and a revised ternary complex mechanism at serotonin 5-HT(2A) and 5-HT(2C) receptors. Synapse 35:144-50 (2000)  
Target
Name:
5-hydroxytryptamine receptor 2A
Synonyms:
5-HT-2 5-HT2A 5-hydroxytryptamine receptor 2A (5HT-2A) 5HT2A_HUMAN HTR2A | Serotonin receptor 2A
Type:
undefined
Mol. Mass.:
52607.65
Organism:
Homo sapiens (Human)
Description:
P28223
Residue:
471
  
Inhibitor
Name:
BDBM50001915
Synonyms:
1-(3-chlorophenyl)piperazine m-Chlorophenylpiperazine | mCPP
Type:
Small organic molecule
Emp. Form.:
C10H13ClN2
Mol. Mass.:
196.677
SMILES:
Clc1cccc(c1)N1CCNCC1
: