Target
Hematopoietic prostaglandin D synthase
Ligand
BDBM85605
Substrate
Ki
>10000±n/a nM
Comments
PDSP_4311
Citation
 Abramovitz, MAdam, MBoie, YCarrière, MDenis, DGodbout, CLamontagne, SRochette, CSawyer, NTremblay, NMBelley, MGallant, MDufresne, CGareau, YRuel, RJuteau, HLabelle, MOuimet, NMetters, KM The utilization of recombinant prostanoid receptors to determine the affinities and selectivities of prostaglandins and related analogs. Biochim Biophys Acta 1483:285-93 (2000)  
Target
Name:
Hematopoietic prostaglandin D synthase
Synonyms:
GSTS Glutathione-requiring prostaglandin D synthase HPGDS Hematopoietic prostaglandin D synthase Hematopoietic prostaglandin D synthase (HPGDS) PTGDS2 Prostaglandin D Synthase
Type:
Enzyme
Mol. Mass.:
23341.07
Organism:
Homo sapiens (Human)
Description:
The protein was expressed in E. coli strain BL21(DE3) with an N-terminal 6-His tag.
Residue:
199
  
Inhibitor
Name:
BDBM85605
Synonyms:
GR 63799
Type:
Small organic molecule
Emp. Form.:
C34H37NO8
Mol. Mass.:
587.6595
SMILES:
OC(COC1C(O)CC(=O)C1CC=CCCCC(=O)Oc1ccc(NC(=O)c2ccccc2)cc1)COc1ccccc1
: