Target
Hematopoietic prostaglandin D synthase
Ligand
BDBM50020300
Substrate
Ki
861±n/a nM
Comments
PDSP_1467
Citation
 Abramovitz, MAdam, MBoie, YCarrière, MDenis, DGodbout, CLamontagne, SRochette, CSawyer, NTremblay, NMBelley, MGallant, MDufresne, CGareau, YRuel, RJuteau, HLabelle, MOuimet, NMetters, KM The utilization of recombinant prostanoid receptors to determine the affinities and selectivities of prostaglandins and related analogs. Biochim Biophys Acta 1483:285-93 (2000)  
Target
Name:
Hematopoietic prostaglandin D synthase
Synonyms:
GSTS Glutathione-requiring prostaglandin D synthase HPGDS Hematopoietic prostaglandin D synthase Hematopoietic prostaglandin D synthase (HPGDS) PTGDS2 Prostaglandin D Synthase
Type:
Enzyme
Mol. Mass.:
23341.07
Organism:
Homo sapiens (Human)
Description:
The protein was expressed in E. coli strain BL21(DE3) with an N-terminal 6-His tag.
Residue:
199
  
Inhibitor
Name:
BDBM50020300
Synonyms:
(S-isomer)7-[3,5-Dihydroxy-2-(3-hydroxy-oct-1-enyl)-cyclopentyl]-hept-5-enoic acid 7-[3,5-Dihydroxy-2-(3-hydroxy-oct-1-enyl)-cyclopentyl]-hept-5-enoic acid PGF2Alpha | Prostaglandin F2alpha7-[3,5-Dihydroxy-2-(3-hydroxy-oct-1-enyl)-cyclopentyl]-hept-5-enoic acid
Type:
Small organic molecule
Emp. Form.:
C20H34O5
Mol. Mass.:
354.481
SMILES:
CCCCC[C@H](O)\C=C\C1[C@H](O)C[C@H](O)[C@@H]1C\C=C/CCCC(O)=O
: