Target
5-hydroxytryptamine receptor 2B
Ligand
BDBM84930
Substrate
Ki
6.31±n/a nM
Comments
PDSP_1151
Citation
 Glusa, EPertz, HH Further evidence that 5-HT-induced relaxation of pig pulmonary artery is mediated by endothelial 5-HT(2B) receptors. Br J Pharmacol 130:692-8 (2000)  
Target
Name:
5-hydroxytryptamine receptor 2B
Synonyms:
5-HT2B 5HT2B_RAT Serotonin 2b (5-HT2b) receptor Srl
Type:
Enzyme Catalytic Domain
Mol. Mass.:
53668.47
Organism:
RAT
Description:
5-HT2B HTR2B RAT::P30994
Residue:
479
  
Inhibitor
Name:
BDBM84930
Synonyms:
CAS_60634-51-7 NSC_107989
Type:
Small organic molecule
Emp. Form.:
C23H32N2O3
Mol. Mass.:
384.5118
SMILES:
CC(O)C(C)OC(=O)C1CC2C(Cc3cn(C(C)C)c4cccc2c34)N(C)C1
: