Target
D(3) dopamine receptor
Ligand
BDBM85672
Substrate
Ki
0.302±n/a nM
Comments
PDSP_2066
Citation
 Cussac, DNewman-Tancredi, ASezgin, LMillan, MJ [3H]S33084: a novel, selective and potent radioligand at cloned, human dopamine D3 receptors. Naunyn Schmiedebergs Arch Pharmacol 361:569-72 (2000)  
Target
Name:
D(3) dopamine receptor
Synonyms:
DOPAMINE D3 DRD3_HUMAN Dopamine D3 receptor (D3) Dopamine receptor Dopamine receptor D3
Type:
Mol. Mass.:
44243.43
Organism:
Homo sapiens (Human)
Description:
Residue:
400
  
Inhibitor
Name:
BDBM85672
Synonyms:
S33084
Type:
Small organic molecule
Emp. Form.:
C29H29N3O2
Mol. Mass.:
451.5595
SMILES:
O=C(NCCCCN1C[C@@H]2COc3ccc(cc3[C@H]2C1)C#N)c1ccc(cc1)-c1ccccc1
: