Target
Hrh3 protein
Ligand
BDBM22904
Substrate
Ki
1.5±n/a nM
Comments
PDSP_1585
Citation
 Lovenberg, TWPyati, JChang, HWilson, SJErlander, MG Cloning of rat histamine H(3) receptor reveals distinct species pharmacological profiles. J Pharmacol Exp Ther 293:771-8 (2000) Target
Name:
Hrh3 protein
Synonyms:
HISTAMINE H3 Hrh3 protein
Type:
Enzyme Catalytic Domain
Mol. Mass.:
37860.96
Organism:
RAT
Description:
Q5PPG3
Residue:
344
  
Inhibitor
Name:
BDBM22904
Synonyms:
(2R)-1-(1H-imidazol-5-yl)propan-2-amine Alpha-Methylhistamine-R CHEMBL268229 RAMH
Type:
Small organic molecule
Emp. Form.:
C6H11N3
Mol. Mass.:
125.1716
SMILES:
C[C@@H](N)Cc1cnc[nH]1
: