Target
Cannabinoid receptor 1
Ligand
BDBM50038644
Substrate
Ki
330±n/a nM
Comments
PDSP_1215
Citation
 Breivogel, CSChilders, SR Cannabinoid agonist signal transduction in rat brain: comparison of cannabinoid agonists in receptor binding, G-protein activation, and adenylyl cyclase inhibition. J Pharmacol Exp Ther 295:328-36 (2000) Target
Name:
Cannabinoid receptor 1
Synonyms:
Brain-type cannabinoid receptor CB-R CNR1_RAT Cannabinoid receptor Cnr1 | Skr6
Type:
G Protein-Coupled Receptor (GPCR)
Mol. Mass.:
52856.55
Organism:
Rattus norvegicus (rat)
Description:
P20272
Residue:
473
  
Inhibitor
Name:
BDBM50038644
Synonyms:
(5Z,8Z,11Z,14Z)-Icosa-5,8,11,14-tetraenoic acid (2-hydroxy-1-methyl-ethyl)-amide Icosa-5,8,11,14-tetraenoic acid(2-hydroxy-1-methyl-ethyl)-amide (0610) | Methanandamide
Type:
Small organic molecule
Emp. Form.:
C23H39NO2
Mol. Mass.:
361.5613
SMILES:
CCCCC\C=C/C\C=C/C\C=C/C\C=C/CCCC(=O)NC(C)CO
: