Target
Gamma-aminobutyric acid receptor subunit alpha-2
Ligand
BDBM85683
Substrate
Ki
200±n/a nM
Comments
PDSP_555
Citation
 Vanover, KERosenzweig-Lipson, SHawkinson, JELan, NCBelluzzi, JDStein, LBarrett, JEWood, PLCarter, RB Characterization of the anxiolytic properties of a novel neuroactive steroid, Co 2-6749 (GMA-839; WAY-141839; 3alpha, 21-dihydroxy-3beta-trifluoromethyl-19-nor-5beta-pregnan-20-one), a selective modulator of gamma-aminobutyric acid(A) receptors. J Pharmacol Exp Ther 295:337-45 (2000) Target
Name:
Gamma-aminobutyric acid receptor subunit alpha-2
Synonyms:
GABA A Alpha2Beta2Gamma2 GABA A receptor alpha-2/beta-2/gamma-2 GABA(A) receptor subunit alpha-2 Gabra-2 Gamma-aminobutyric acid receptor subunit alpha-2
Type:
Enzyme
Mol. Mass.:
51195.57
Organism:
Rattus norvegicus (Rat)
Description:
P23576
Residue:
451
  
Inhibitor
Name:
BDBM85683
Synonyms:
Co 2-6749 GMA-839 | WAY-141839
Type:
Small organic molecule
Emp. Form.:
C21H31F3O3
Mol. Mass.:
388.4642
SMILES:
C[C@]12CC[C@H]3[C@@H](CC[C@@H]4C[C@](O)(CC[C@H]34)C(F)(F)F)[C@@H]1CC[C@@H]2C(=O)CO
: