Target
Leukotriene B4 receptor 2
Ligand
BDBM85685
Substrate
Ki
473±n/a nM
Comments
PDSP_1104
Citation
 Wang, SGustafson, EPang, LQiao, XBehan, JMaguire, MBayne, MLaz, T A novel hepatointestinal leukotriene B4 receptor. Cloning and functional characterization. J Biol Chem 275:40686-94 (2000)  
Target
Name:
Leukotriene B4 receptor 2
Synonyms:
BLT2R LT4R2_HUMAN LTB4-R 2 LTB4R2 Leukotriene B4 Leukotriene B4 receptor Leukotriene B4 receptor BLT2 Seven transmembrane receptor BLTR2
Type:
Enzyme Catalytic Domain
Mol. Mass.:
37964.86
Organism:
Homo sapiens (Human)
Description:
Leukotriene 2 0 HUMAN::Q9NPC1
Residue:
358
  
Inhibitor
Name:
BDBM85685
Synonyms:
LTB4-14,15-dehydro
Type:
Small organic molecule
Emp. Form.:
C20H32O6
Mol. Mass.:
368.4645
SMILES:
CCCCCC(O)C(=O)C[C@@H](O)C=CC=C\C=C/[C@@H](O)CCCC(O)=O
: