Target
Leukotriene B4 receptor 2
Ligand
BDBM85689
Substrate
Ki
1000±n/a nM
Comments
PDSP_1108
Citation
 Wang, SGustafson, EPang, LQiao, XBehan, JMaguire, MBayne, MLaz, T A novel hepatointestinal leukotriene B4 receptor. Cloning and functional characterization. J Biol Chem 275:40686-94 (2000)  
Target
Name:
Leukotriene B4 receptor 2
Synonyms:
BLT2R LT4R2_HUMAN LTB4-R 2 LTB4R2 Leukotriene B4 Leukotriene B4 receptor Leukotriene B4 receptor BLT2 Seven transmembrane receptor BLTR2
Type:
Enzyme Catalytic Domain
Mol. Mass.:
37964.86
Organism:
Homo sapiens (Human)
Description:
Leukotriene 2 0 HUMAN::Q9NPC1
Residue:
358
  
Inhibitor
Name:
BDBM85689
Synonyms:
LTB4-6-trans
Type:
Small organic molecule
Emp. Form.:
C20H32O4
Mol. Mass.:
336.4657
SMILES:
CCCCC\C=C/C[C@@H](O)\C=C\C=C\C=C\[C@@H](O)CCCC(O)=O
: