Target
Voltage-dependent calcium channel gamma-1 subunit
Ligand
BDBM50094703
Substrate
Ki
>10000±n/a nM
Comments
PDSP_2986
Citation
 Jarvis, MFYu, HKohlhaas, KAlexander, KLee, CHJiang, MBhagwat, SSWilliams, MKowaluk, EA ABT-702 (4-amino-5-(3-bromophenyl)-7-(6-morpholinopyridin-3-yl)pyrido[2, 3-d]pyrimidine), a novel orally effective adenosine kinase inhibitor with analgesic and anti-inflammatory properties: I. In vitro characterization and acute antinociceptive effects in the mouse. J Pharmacol Exp Ther 295:1156-64 (2000) Target
Name:
Voltage-dependent calcium channel gamma-1 subunit
Synonyms:
CACNG1 CCG1_HUMAN Voltage-dependent calcium channel gamma-1 subunit
Type:
Enzyme Catalytic Domain
Mol. Mass.:
25030.69
Organism:
Homo sapiens (Human)
Description:
Calcium channel (DHP) 0 0::Q06432
Residue:
222
  
Inhibitor
Name:
BDBM50094703
Synonyms:
5-(3-Bromo-phenyl)-7-(6-morpholin-4-yl-pyridin-3-yl)-pyrido[2,3-d]pyrimidin-4-ylamine ABT-702 | CHEMBL66089
Type:
Small organic molecule
Emp. Form.:
C22H19BrN6O
Mol. Mass.:
463.33
SMILES:
Nc1ncnc2nc(cc(-c3cccc(Br)c3)c12)-c1ccc(nc1)N1CCOCC1
: