Target
Alpha-1B adrenergic receptor
Ligand
BDBM50241196
Substrate
Ki
316.2278±n/a nM
Comments
PDSP_3304
Citation
 Millan, MJDekeyne, ANewman-Tancredi, ACussac, DAudinot, VMilligan, GDuqueyroix, DGirardon, SMullot, JBoutin, JANicolas, JPRenouard-Try, ALacoste, JMCordi, A S18616, a highly potent, spiroimidazoline agonist at alpha(2)-adrenoceptors: I. Receptor profile, antinociceptive and hypothermic actions in comparison with dexmedetomidine and clonidine. J Pharmacol Exp Ther 295:1192-205 (2000) Target
Name:
Alpha-1B adrenergic receptor
Synonyms:
ADA1B_RAT Alpha 1B-adrenoceptor Alpha adrenergic receptor 1A and 1B Alpha-1Adrenoceptor Alpha-1B adrenoreceptor | adrenergic Alpha1B
Type:
G Protein-Coupled Receptor (GPCR)
Mol. Mass.:
56606.71
Organism:
Rattus norvegicus (rat)
Description:
Receptor binding assays were performed using rat cortical membranes.
Residue:
515
  
Inhibitor
Name:
BDBM50241196
Synonyms:
(R)-5-(1-(2,3-dimethylphenyl)ethyl)-1H-imidazole CHEMBL397901 | Dexmedetomidine
Type:
Small organic molecule
Emp. Form.:
C13H16N2
Mol. Mass.:
200.2795
SMILES:
C[C@@H](c1cnc[nH]1)c1cccc(C)c1C
: