Target
P2X purinoceptor 7
Ligand
BDBM50000029
Substrate
Ki
>10000±n/a nM
Comments
PDSP_3349
Citation
 Lambrecht, G Agonists and antagonists acting at P2X receptors: selectivity profiles and functional implications. Naunyn Schmiedebergs Arch Pharmacol 362:340-50 (2000)  
Target
Name:
P2X purinoceptor 7
Synonyms:
ATP receptor P2RX7_HUMAN P2X purinoceptor 7 (P2X7) P2Z receptor | Purinergic receptor
Type:
Protein
Mol. Mass.:
68602.85
Organism:
Homo sapiens (Human)
Description:
Q99572
Residue:
595
  
Inhibitor
Name:
BDBM50000029
Synonyms:
4-Methyl-8-{4-methyl-3-[3-(3-{3-[2-methyl-5-(4,6,8-trisulfo-naphthalen-1-ylcarbamoyl)-phenylcarbamoyl]-phenyl}-ureido)-benzoylamino]-benzoylamino}-naphthalene-1,3,5-trisulfonic acid; hexa-kis Sodium salt CHEMBL265502 Suramin sodium suramin Na
Type:
Small organic molecule
Emp. Form.:
C51H34N6O23S6
Mol. Mass.:
1291.235
SMILES:
Cc1ccc(cc1NC(=O)c1cccc(NC(=O)Nc2cccc(c2)C(=O)Nc2cc(ccc2C)C(=O)Nc2ccc(c3cc(cc(c23)S([O-])(=O)=O)S([O-])(=O)=O)S([O-])(=O)=O)c1)C(=O)Nc1ccc(c2cc(cc(c12)S([O-])(=O)=O)S([O-])(=O)=O)S([O-])(=O)=O
: