Target
5-hydroxytryptamine receptor 1D
Ligand
BDBM35255
Substrate
Ki
80±n/a nM
Comments
PDSP_2002
Citation
 Richelson, ESouder, T Binding of antipsychotic drugs to human brain receptors focus on newer generation compounds. Life Sci 68:29-39 (2000)  
Target
Name:
5-hydroxytryptamine receptor 1D
Synonyms:
5-HT-1D 5-HT1D 5HT1D_HUMAN HTR1DA Serotonin (5-HT) receptor | Serotonin Receptor 1D
Type:
G Protein-Coupled Receptor (GPCR)
Mol. Mass.:
41920.63
Organism:
Homo sapiens (Human)
Description:
Receptor binding assays were performed using human clone stably expressed in CHO cells.
Residue:
377
  
Inhibitor
Name:
BDBM35255
Synonyms:
2-Chlor-11-(2-dimethylaminoaethoxy)-dibenzo(b,f)-thiepin 2-[(8-chlorodibenzo[b,f]thiepin-10-yl)oxy]-N,N-dimethylethanamine Nipolept zotepine
Type:
Small organic molecule
Emp. Form.:
C18H18ClNOS
Mol. Mass.:
331.86
SMILES:
CN(C)CCOC1=Cc2ccccc2Sc2ccc(Cl)cc12
: