Target
Glutamate receptor 3
Ligand
BDBM50252103
Substrate
Ki
927±n/a nM
Comments
PDSP_725
Citation
 Sakai, RSwanson, GTShimamoto, KGreen, TContractor, AGhetti, ATamura-Horikawa, YOiwa, CKamiya, H Pharmacological properties of the potent epileptogenic amino acid dysiherbaine, a novel glutamate receptor agonist isolated from the marine sponge Dysidea herbacea. J Pharmacol Exp Ther 296:650-8 (2001) Target
Name:
Glutamate receptor 3
Synonyms:
GRIA3_RAT Glutamate receptor 3 Glutamate-AMPA | Gria3
Type:
Enzyme Catalytic Domain
Mol. Mass.:
100383.57
Organism:
RAT
Description:
Glutamate-AMPA GRIA3 RAT::P19492
Residue:
888
  
Inhibitor
Name:
BDBM50252103
Synonyms:
(2S,3S,4S)-2-CARBOXY-4-[(1Z,3E,5R)-5-CARBOXY-1-METHYL-1,3-HEXADIENYL]-3-PYRROLIDINEACETIC ACID domoic acid | domoric acid
Type:
Small organic molecule
Emp. Form.:
C15H21NO6
Mol. Mass.:
311.3303
SMILES:
C[C@H](\C=C\C=C(/C)[C@H]1CN[C@@H]([C@H]1CC(O)=O)C(O)=O)C(O)=O
: