Target
Melanin-concentrating hormone receptor 2
Ligand
BDBM85790
Substrate
Ki
436.7±n/a nM
Comments
PDSP_2440
Citation
 Sailer, AWSano, HZeng, ZMcDonald, TPPan, JPong, SSFeighner, SDTan, CPFukami, TIwaasa, HHreniuk, DLMorin, NRSadowski, SJIto, MIto, MBansal, AKy, BFigueroa, DJJiang, QAustin, CPMacNeil, DJIshihara, AIhara, MKanatani, AVan der Ploeg, LHHoward, ADLiu, Q Identification and characterization of a second melanin-concentrating hormone receptor, MCH-2R. Proc Natl Acad Sci U S A 98:7564-9 (2001)  
Target
Name:
Melanin-concentrating hormone receptor 2
Synonyms:
GPR145 MCHR2_HUMAN Melanin-concentrating hormone receptor SLT
Type:
Enzyme Catalytic Domain
Mol. Mass.:
38862.16
Organism:
Homo sapiens (Human)
Description:
Melanin Concentrating Hormone 2 GPR145 HUMAN::Q969V1
Residue:
340
  
Inhibitor
Name:
BDBM85790
Synonyms:
Salmon MCH
Type:
Small organic molecule
Emp. Form.:
C89H139N27O24S4
Mol. Mass.:
2099.482
SMILES:
CSCCC(NC(=O)C(NC(=O)C(N)CC(O)=O)C(C)O)C(=O)NC(CCCN=C(N)N)C(=O)NC1CSSCC(NC(=O)C2CCCN2C(=O)C(CCCN=C(N)N)NC(=O)C(Cc2ccc(O)cc2)NC(=O)C(NC(=O)C(CCCN=C(N)N)NC(=O)CNC(=O)C(NC(=O)C(CCSC)NC1=O)C(C)C)C(C)C)C(=O)NC(Cc1c[nH]c2ccccc12)C(=O)NC(CCC(O)=O)C(=O)NC(C(C)C)C(O)=O
: