Target
Alpha-2A adrenergic receptor
Ligand
BDBM50020192
Substrate
Ki
28.3±n/a nM
Comments
PDSP_1743
Citation
 Naselsky, DPAshton, DRuffolo, RRHieble, JP Rabbit alpha2-adrenoceptors: both platelets and adipocytes have alpha2A-pharmacology. J Pharmacol Exp Ther 298:219-25 (2001) Target
Name:
Alpha-2A adrenergic receptor
Synonyms:
ADA2A_HUMAN ADRA2R Adrenergic alpha2A Alpha-2 adrenergic receptor subtype C10 Alpha-2A adrenoreceptor alpha-2A adrenergic receptor [Homo sapiens]
Type:
Enzyme
Mol. Mass.:
48979.91
Organism:
Homo sapiens (Human)
Description:
P08913
Residue:
450
  
Inhibitor
Name:
BDBM50020192
Synonyms:
8-(2,3-Dihydro-benzo[1,4]dioxin-2-ylmethyl)-1-phenyl-1,3,8-triaza-spiro[4.5]decan-4-one Spiroxatrine
Type:
Small organic molecule
Emp. Form.:
C22H25N3O3
Mol. Mass.:
379.4522
SMILES:
O=C1NCN(c2ccccc2)C11CCN(CC2COc3ccccc3O2)CC1
: