Target
5-hydroxytryptamine receptor 3A
Ligand
BDBM50122872
Substrate
Ki
3822±n/a nM
Comments
PDSP_1544
Citation
 Briejer, MRBosmans, JPVan Daele, PJurzak, MHeylen, LLeysen, JEPrins, NHSchuurkes, JA The in vitro pharmacological profile of prucalopride, a novel enterokinetic compound. Eur J Pharmacol 423:71-83 (2001)  
Target
Name:
5-hydroxytryptamine receptor 3A
Synonyms:
5-HT-3 5-HT3A 5-HT3R 5-hydroxytryptamine receptor 3A 5ht3 Htr3a Serotonin 3a (5-HT3a) receptor Serotonin-gated ion channel receptor
Type:
Mol. Mass.:
56056.00
Organism:
Mus musculus (house mouse)
Description:
5HT3A
Residue:
487
  
Inhibitor
Name:
BDBM50122872
Synonyms:
4-Amino-5-chloro-2,3-dihydro-benzofuran-7-carboxylic acid [1-(3-methoxy-propyl)-piperidin-4-yl]-amide PRUCALOPRIDE | US9663465, prucalopride
Type:
Small organic molecule
Emp. Form.:
C18H26ClN3O3
Mol. Mass.:
367.87
SMILES:
COCCCN1CCC(CC1)NC(=O)c1cc(Cl)c(N)c2CCOc12
: