Target
5-hydroxytryptamine receptor 5A
Ligand
BDBM85818
Substrate
Ki
>10000±n/a nM
Comments
PDSP_2008
Citation
 Roth, BLErnsberger, PSteinberg, SARao, SRauser, LSavage, JHufeisen, SBerridge, MSMuzic, RF The in vitro pharmacology of the beta-adrenergic receptor pet ligand (s)-fluorocarazolol reveals high affinity for cloned beta-adrenergic receptors and moderate affinity for the human 5-HT1A receptor. Psychopharmacology (Berl) 157:111-4 (2001)  
Target
Name:
5-hydroxytryptamine receptor 5A
Synonyms:
5-HT-5 5-hydroxytryptamine receptor 5 (5-HT5) 5HT5A_HUMAN Serotonin (5-HT) receptor | Serotonin receptor 5A
Type:
Enzyme
Mol. Mass.:
40266.25
Organism:
Homo sapiens (Human)
Description:
P47898
Residue:
357
  
Inhibitor
Name:
BDBM85818
Synonyms:
Fluorocarazolol,(R) | Fluorocarazolol,(S)
Type:
Small organic molecule
Emp. Form.:
C18H21FN2O2
Mol. Mass.:
316.3699
SMILES:
CC(CF)NCC(O)COc1cccc2[nH]c3ccccc3c12
: