Target
Gamma-aminobutyric acid type B receptor subunit 1
Ligand
BDBM85818
Substrate
Ki
>10000±n/a nM
Comments
PDSP_2009
Citation
 Roth, BLErnsberger, PSteinberg, SARao, SRauser, LSavage, JHufeisen, SBerridge, MSMuzic, RF The in vitro pharmacology of the beta-adrenergic receptor pet ligand (s)-fluorocarazolol reveals high affinity for cloned beta-adrenergic receptors and moderate affinity for the human 5-HT1A receptor. Psychopharmacology (Berl) 157:111-4 (2001)  
Target
Name:
Gamma-aminobutyric acid type B receptor subunit 1
Synonyms:
GABA B GABA uptake GABA-B-R1 GABABR1 Gabbr1 | Gb1
Type:
Enzyme Catalytic Domain
Mol. Mass.:
111548.69
Organism:
Rattus norvegicus (Rat)
Description:
Q9Z0U4
Residue:
991
  
Inhibitor
Name:
BDBM85818
Synonyms:
Fluorocarazolol,(R) | Fluorocarazolol,(S)
Type:
Small organic molecule
Emp. Form.:
C18H21FN2O2
Mol. Mass.:
316.3699
SMILES:
CC(CF)NCC(O)COc1cccc2[nH]c3ccccc3c12
: