Target
Glutamate receptor ionotropic, NMDA 1
Ligand
BDBM85818
Substrate
Ki
>10000±n/a nM
Comments
PDSP_2008
Citation
 Roth, BLErnsberger, PSteinberg, SARao, SRauser, LSavage, JHufeisen, SBerridge, MSMuzic, RF The in vitro pharmacology of the beta-adrenergic receptor pet ligand (s)-fluorocarazolol reveals high affinity for cloned beta-adrenergic receptors and moderate affinity for the human 5-HT1A receptor. Psychopharmacology (Berl) 157:111-4 (2001)  
Target
Name:
Glutamate receptor ionotropic, NMDA 1
Synonyms:
Glutamate (NMDA) receptor subunit zeta 1 Glutamate-NMDA-Channel Glutamate-NMDA-Polyamine NMDA Nmdar1 | phencyclidine
Type:
Enzyme Catalytic Domain
Mol. Mass.:
105533.40
Organism:
RAT
Description:
P35439
Residue:
938
  
Inhibitor
Name:
BDBM85818
Synonyms:
Fluorocarazolol,(R) | Fluorocarazolol,(S)
Type:
Small organic molecule
Emp. Form.:
C18H21FN2O2
Mol. Mass.:
316.3699
SMILES:
CC(CF)NCC(O)COc1cccc2[nH]c3ccccc3c12
: