Target
Vasopressin V2 receptor
Ligand
BDBM85818
Substrate
Ki
>10000±n/a nM
Comments
PDSP_2009
Citation
 Roth, BLErnsberger, PSteinberg, SARao, SRauser, LSavage, JHufeisen, SBerridge, MSMuzic, RF The in vitro pharmacology of the beta-adrenergic receptor pet ligand (s)-fluorocarazolol reveals high affinity for cloned beta-adrenergic receptors and moderate affinity for the human 5-HT1A receptor. Psychopharmacology (Berl) 157:111-4 (2001)  
Target
Name:
Vasopressin V2 receptor
Synonyms:
ADHR AVPR2 DIR Renal-type arginine vasopressin receptor V2R_HUMAN Vasopressin V2 receptor | Vasopressin receptor
Type:
Receptor
Mol. Mass.:
40295.28
Organism:
Homo sapiens (Human)
Description:
P30518
Residue:
371
  
Inhibitor
Name:
BDBM85818
Synonyms:
Fluorocarazolol,(R) | Fluorocarazolol,(S)
Type:
Small organic molecule
Emp. Form.:
C18H21FN2O2
Mol. Mass.:
316.3699
SMILES:
CC(CF)NCC(O)COc1cccc2[nH]c3ccccc3c12
: