Target
Glutamate receptor ionotropic, NMDA 1
Ligand
BDBM2219
Substrate
Ki
>10000±n/a nM
Comments
PDSP_3684
Citation
 Johansen, TNStensbøl, TBNielsen, BVogensen, SBFrydenvang, KSløk, FABräüner-Osborne, HMadsen, UKrogsgaard-Larsen, P Resolution, configurational assignment, and enantiopharmacology at glutamate receptors of 2-amino-3-(3-carboxy-5-methyl-4-isoxazolyl)propionic acid (ACPA) and demethyl-ACPA. Chirality 13:523-32 (2001)  
Target
Name:
Glutamate receptor ionotropic, NMDA 1
Synonyms:
Glutamate (NMDA) receptor subunit zeta 1 Glutamate-NMDA-Channel Glutamate-NMDA-Polyamine NMDA Nmdar1 | phencyclidine
Type:
Enzyme Catalytic Domain
Mol. Mass.:
105533.40
Organism:
RAT
Description:
P35439
Residue:
938
  
Inhibitor
Name:
BDBM2219
Synonyms:
(S)-Demethyl-ACPA | Demethyl-ACPA
Type:
Emp. Form.:
C7H8N2O5
Mol. Mass.:
200.1488
SMILES:
N[C@@H](Cc1conc1C(O)=O)C(O)=O
: