Target
Sodium-dependent dopamine transporter
Ligand
BDBM85933
Substrate
Ki
83±n/a nM
Comments
PDSP_2117
Citation
 Schweri, MMDeutsch, HMMassey, ATHoltzman, SG Biochemical and behavioral characterization of novel methylphenidate analogs. J Pharmacol Exp Ther 301:527-35 (2002)  
Target
Name:
Sodium-dependent dopamine transporter
Synonyms:
DA transporter SC6A3_RAT Sodium-dependent dopamine transporter | Sodium-dependent dopamine transporter (DAT)
Type:
Multi-pass membrane protein
Mol. Mass.:
68749.45
Organism:
Rattus norvegicus (rat)
Description:
P23977
Residue:
619
  
Inhibitor
Name:
BDBM85933
Synonyms:
TMP | US11001595, Compound TMP
Type:
Small organic molecule
Emp. Form.:
C14H19NO2
Mol. Mass.:
233.3062
SMILES:
COC(=O)[C@@H]([C@@H]1CCCCN1)c1ccccc1
: