Target
Promotilin
Ligand
BDBM85980
Substrate
Ki
6.31±n/a nM
Comments
PDSP_6202
Citation
 Thielemans, LDepoortere, IVanden Broeck, JPeeters, TL The motilin pharmacophore in CHO cells expressing the human motilin receptor. Biochem Biophys Res Commun 293:1223-7 (2002)  
Target
Name:
Promotilin
Synonyms:
MLN Motilin | Promotilin
Type:
Enzyme Catalytic Domain
Mol. Mass.:
12919.83
Organism:
Homo sapiens (Human)
Description:
Motilin 0 HUMAN::P12872
Residue:
115
  
Inhibitor
Name:
BDBM85980
Synonyms:
[ala12,leu13]pMOT(1-14)
Type:
Small organic molecule
Emp. Form.:
C79H117N17O20
Mol. Mass.:
1624.8762
SMILES:
CC[C@H](C)[C@H](NC(=O)[C@@H]1CCCN1C(=O)[C@@H](NC(=O)[C@@H](N)Cc1ccccc1)C(C)C)C(=O)N[C@@H](Cc1ccccc1)C(=O)N[C@@H]([C@@H](C)O)C(=O)N[C@@H](Cc1ccc(O)cc1)C(=O)NCC(=O)N[C@@H](CCC(O)=O)C(=O)N[C@@H](CC(C)C)C(=O)N[C@@H](CCC(N)=O)C(=O)N[C@@H](C)C(=O)N[C@@H](CC(C)C)C(=O)N[C@@H](CCC(N)=O)C(N)=O
: