Target
Promotilin
Ligand
BDBM85979
Substrate
Ki
1.32±n/a nM
Comments
PDSP_6193
Citation
 Thielemans, LDepoortere, IVanden Broeck, JPeeters, TL The motilin pharmacophore in CHO cells expressing the human motilin receptor. Biochem Biophys Res Commun 293:1223-7 (2002)  
Target
Name:
Promotilin
Synonyms:
MLN Motilin | Promotilin
Type:
Enzyme Catalytic Domain
Mol. Mass.:
12919.83
Organism:
Homo sapiens (Human)
Description:
Motilin 0 HUMAN::P12872
Residue:
115
  
Inhibitor
Name:
BDBM85979
Synonyms:
[ala3,leu13]pMOT(1-14)
Type:
Small organic molecule
Emp. Form.:
C79H120N20O20
Mol. Mass.:
1669.9201
SMILES:
[#6]-[#6]-[#6@H](-[#6])-[#6@H](-[#7]-[#6](=O)-[#6]-[#7]-[#6](=O)-[#6@@H](-[#7]-[#6](=O)-[#6@@H](-[#7])-[#6]-c1ccccc1)-[#6](-[#6])-[#6])-[#6](=O)-[#7]-[#6@@H](-[#6]-c1ccccc1)-[#6](=O)-[#7]-[#6@@H](-[#6@@H](-[#6])-[#8])-[#6](=O)-[#7]-[#6@@H](-[#6]-c1ccc(-[#8])cc1)-[#6](=O)-[#7]-[#6]-[#6](=O)-[#7]-[#6@@H](-[#6]-[#6]-[#6](-[#8])=O)-[#6](=O)-[#7]-[#6@@H](-[#6]-[#6](-[#6])-[#6])-[#6](=O)-[#7]-[#6@@H](-[#6]-[#6]-[#6](-[#7])=O)-[#6](=O)-[#7]-[#6@@H](-[#6]-[#6]-[#6]\[#7]=[#6](/[#7])-[#7])-[#6](=O)-[#7]-[#6@@H](-[#6]-[#6](-[#6])-[#6])-[#6](=O)-[#7]-[#6@@H](-[#6]-[#6]-[#6](-[#7])=O)-[#6](-[#7])=O
: