Target
Promotilin
Ligand
BDBM85994
Substrate
Ki
0.98±n/a nM
Comments
PDSP_6190
Citation
 Thielemans, LDepoortere, IVanden Broeck, JPeeters, TL The motilin pharmacophore in CHO cells expressing the human motilin receptor. Biochem Biophys Res Commun 293:1223-7 (2002)  
Target
Name:
Promotilin
Synonyms:
MLN Motilin | Promotilin
Type:
Enzyme Catalytic Domain
Mol. Mass.:
12919.83
Organism:
Homo sapiens (Human)
Description:
Motilin 0 HUMAN::P12872
Residue:
115
  
Inhibitor
Name:
BDBM85994
Synonyms:
[leu13]pMOT(1-19)
Type:
Small organic molecule
Emp. Form.:
C108H168N30O30
Mol. Mass.:
2366.6725
SMILES:
[#6]-[#6]-[#6@H](-[#6])-[#6@H](-[#7]-[#6](=O)-[#6@@H]-1-[#6]-[#6]-[#6]-[#7]-1-[#6](=O)-[#6@@H](-[#7]-[#6](=O)-[#6@@H](-[#7])-[#6]-c1ccccc1)-[#6](-[#6])-[#6])-[#6](=O)-[#7]-[#6@@H](-[#6]-c1ccccc1)-[#6](=O)-[#7]-[#6@@H](-[#6@@H](-[#6])-[#8])-[#6](=O)-[#7]-[#6@@H](-[#6]-c1ccc(-[#8])cc1)-[#6](=O)-[#7]-[#6]-[#6](=O)-[#7]-[#6@@H](-[#6]-[#6]-[#6](-[#8])=O)-[#6](=O)-[#7]-[#6@@H](-[#6]-[#6](-[#6])-[#6])-[#6](=O)-[#7]-[#6@@H](-[#6]-[#6]-[#6](-[#7])=O)-[#6](=O)-[#7]-[#6@@H](-[#6]-[#6]-[#6]\[#7]=[#6](/[#7])-[#7])-[#6](=O)-[#7]-[#6@@H](-[#6]-[#6](-[#6])-[#6])-[#6](=O)-[#7]-[#6@@H](-[#6]-[#6]-[#6](-[#7])=O)-[#6](=O)-[#7]-[#6@@H](-[#6]-[#6]-[#6](-[#8])=O)-[#6](=O)-[#7]-[#6@@H](-[#6]-[#6]-[#6]-[#6]-[#7])-[#6](=O)-[#7]-[#6@@H](-[#6]-[#6]-[#6](-[#8])=O)-[#6](=O)-[#7]-[#6@@H](-[#6]-[#6]-[#6]\[#7]=[#6](/[#7])-[#7])-[#6](=O)-[#7]-[#6@@H](-[#6]-[#6](-[#7])=O)-[#6](-[#7])=O
: