Target
Acetylcholinesterase
Ligand
BDBM8961
Substrate
Meas. Tech.
Enzyme Inhibition Assay
Temperature
303.15±0 K
Ki
2.3e+2± 2e+1 nM
Citation
 Atta-ur-Rahman, AKhalid, ASultana, NGhayur, MNMesaik, MAKhan, MRGilani, AHChoudhary, MI New natural cholinesterase inhibiting and calcium channel blocking quinoline alkaloids. J Enzyme Inhib Med Chem 21:703-10 (2006)  
Target
Name:
Acetylcholinesterase
Synonyms:
3.1.1.7 Acetylcholinesterase (AChE) ache
Type:
Mol. Mass.:
65900.74
Organism:
Tetronarce californica (Pacific electric ray) (Torpedo californica)
Description:
P04058
Residue:
586
  
Inhibitor
Name:
BDBM8961
Synonyms:
1,2,3,4-tetrahydro-9-acridinamine 9-THA CHEMBL1337960 Cognex Tracine cid_1935 | tacrine.HCl
Type:
Small organic molecule
Emp. Form.:
C13H14N2
Mol. Mass.:
198.2637
SMILES:
Nc1c2CCCCc2nc2ccccc12
: