Target
D(1B) dopamine receptor
Ligand
BDBM50242259
Substrate
Ki
>10000±n/a nM
Comments
PDSP_3172
Citation
 Butterweck, VNahrstedt, AEvans, JHufeisen, SRauser, LSavage, JPopadak, BErnsberger, PRoth, BL In vitro receptor screening of pure constituents of St. John's wort reveals novel interactions with a number of GPCRs. Psychopharmacology (Berl) 162:193-202 (2002)  
Target
Name:
D(1B) dopamine receptor
Synonyms:
D(5) dopamine receptor DOPAMINE D5 DRD1L2 DRD5_HUMAN | dopamine receptor D5
Type:
Protein
Mol. Mass.:
52943.41
Organism:
Homo sapiens (Human)
Description:
P21918
Residue:
477
  
Inhibitor
Name:
BDBM50242259
Synonyms:
CHEMBL516641 | HYPERFORIN
Type:
Small organic molecule
Emp. Form.:
C35H52O4
Mol. Mass.:
536.785
SMILES:
[#6]-[#6](-[#6])-[#6](=O)[C@]12[#6](=O)-[#6](-[#6]\[#6]=[#6](/[#6])-[#6])-[#6](=O)[C@@]([#6]\[#6]=[#6](\[#6])-[#6])([#6]-[#6@H](-[#6]\[#6]=[#6](/[#6])-[#6])[C@@]1([#6])[#6]-[#6]\[#6]=[#6](/[#6])-[#6])[#6]2=O
: