Target
Glutamate receptor ionotropic, NMDA 1
Ligand
BDBM86036
Substrate
Ki
>10000±n/a nM
Comments
PDSP_3177
Citation
 Butterweck, VNahrstedt, AEvans, JHufeisen, SRauser, LSavage, JPopadak, BErnsberger, PRoth, BL In vitro receptor screening of pure constituents of St. John's wort reveals novel interactions with a number of GPCRs. Psychopharmacology (Berl) 162:193-202 (2002)  
Target
Name:
Glutamate receptor ionotropic, NMDA 1
Synonyms:
Glutamate (NMDA) receptor subunit zeta 1 Glutamate-NMDA-Channel Glutamate-NMDA-Polyamine NMDA Nmdar1 | phencyclidine
Type:
Enzyme Catalytic Domain
Mol. Mass.:
105533.40
Organism:
RAT
Description:
P35439
Residue:
938
  
Inhibitor
Name:
BDBM86036
Synonyms:
CAS_5318390 Hyperoside NSC_5318390 | NSC_97331
Type:
Small organic molecule
Emp. Form.:
C21H20O12
Mol. Mass.:
464.3763
SMILES:
OCC1OC(Oc2c(O)c3c(cc(O)cc3=O)oc2-c2ccc(O)c(O)c2)C(O)C(O)C1O
: