Target
Potassium voltage-gated channel subfamily H member 2
Ligand
BDBM50095890
Substrate
Ki
5765±n/a nM
Comments
PDSP_1571
Citation
 Kongsamut, SKang, JChen, XLRoehr, JRampe, D A comparison of the receptor binding and HERG channel affinities for a series of antipsychotic drugs. Eur J Pharmacol 450:37-41 (2002)  
Target
Name:
Potassium voltage-gated channel subfamily H member 2
Synonyms:
1,3-beta-glucan synthase component GLS2 ERG Eag-related protein 1 Ether-a-go-go-related gene (HERG) Ether-a-go-go-related gene potassium channel 1 Ether-a-go-go-related gene potassium channel 1 (hERG1) Ether-a-go-go-related protein 1 H-ERG KCNH2 Potassium voltage-gated channel subfamily H member 2 (hERG) Voltage-gated potassium channel subunit Kv11.1 hERG Potassium Channel 1 | putative potassium channel subunit
Type:
Multi-pass membrane protein
Mol. Mass.:
126672.65
Organism:
Homo sapiens (Human)
Description:
Q12809
Residue:
1159
  
Inhibitor
Name:
BDBM50095890
Synonyms:
2-[2-(4-Dibenzo[b,f][1,4]thiazepin-11-yl-1-piperazinyl)ethoxy]ethanol CHEMBL716 | QUETIAPINE
Type:
Small organic molecule
Emp. Form.:
C21H25N3O2S
Mol. Mass.:
383.507
SMILES:
OCCOCCN1CCN(CC1)C1=Nc2ccccc2Sc2ccccc12
: