Target
Neuronal acetylcholine receptor subunit alpha-3
Ligand
BDBM50159165
Substrate
Ki
>10000±n/a nM
Comments
PDSP_2950
Citation
 Roth, BLBaner, KWestkaemper, RSiebert, DRice, KCSteinberg, SErnsberger, PRothman, RB Salvinorin A: a potent naturally occurring nonnitrogenous kappa opioid selective agonist. Proc Natl Acad Sci U S A 99:11934-9 (2002)  
Target
Name:
Neuronal acetylcholine receptor subunit alpha-3
Synonyms:
ACHA3_HUMAN Cholinergic, Nicotinic Alpha3Beta2 Cholinergic, Nicotinic Alpha3Beta4x NACHRA3 Neuronal acetylcholine receptor subunit alpha-3 nicotinic central
Type:
Enzyme Catalytic Domain
Mol. Mass.:
57479.03
Organism:
Homo sapiens (Human)
Description:
Cholinergic, Nicotinic Alpha3Beta2 0 HUMAN::P32297
Residue:
505
  
Inhibitor
Name:
BDBM50159165
Synonyms:
(2S,4aR,6aR,7R,9S,10aS,10bR)-9-(acetyloxy)-2-(furan-3-yl)dodecahydro-6a,10b-dimethyl-4,10-dioxo-2H-naphtho-[2,1-c]pyran-7-carboxylic acid methyl ester (2S,4aR,6aR,7R,9S,10aS,10bR)-methyl 9-acetoxy-2-(furan-3-yl)-6a,10b-dimethyl-4,10-dioxo-dodecahydro-1H-benzo[f]isochromene-7-carboxylate 2S,4aR,6a(R,7R,9S,10aS,10bR)-9-(acetyloxy)-2-(furan-3-yl)dodecahydro-6a,10b-dimethyl-4,10-dioxo-2H-naphtho[2,1-c]pyran-7-carboxylic acid methyl ester Salvinorin A salvinorin-A
Type:
Small organic molecule
Emp. Form.:
C23H28O8
Mol. Mass.:
432.4636
SMILES:
COC(=O)[C@@H]1C[C@H](OC(C)=O)C(=O)[C@H]2[C@@]1(C)CC[C@H]1C(=O)O[C@@H](C[C@]21C)c1ccoc1
: