Target
5-hydroxytryptamine receptor 2C
Ligand
BDBM22416
Substrate
Ki
9034±n/a nM
Comments
PDSP_1439
Citation
 Owens, JMKnight, DLNemeroff, CB [Second generation SSRIS: human monoamine transporter binding profile of escitalopram and R-fluoxetine]. Encephale 28:350-5 (2002) Target
Name:
5-hydroxytryptamine receptor 2C
Synonyms:
5-HT2C | HTR2C
Type:
Enzyme Catalytic Domain
Mol. Mass.:
51631.71
Organism:
PORCINE
Description:
K7GSR7
Residue:
457
  
Inhibitor
Name:
BDBM22416
Synonyms:
(3S,4R)-3-[(1,3-benzodioxol-5-yloxy)methyl]-4-(4-fluorophenyl)piperidine CHEMBL490 US09969700, Paroxetine [3H]Paroxetine
Type:
radiolabeled ligand
Emp. Form.:
C19H20FNO3
Mol. Mass.:
329.3654
SMILES:
Fc1ccc(cc1)[C@@H]1CCNC[C@H]1COc1ccc2OCOc2c1
: