Target
Muscarinic acetylcholine receptor M2
Ligand
BDBM10759
Substrate
Ki
340±n/a nM
Comments
PDSP_229
Citation
 Cheng, KKhurana, SChen, YKennedy, RHZimniak, PRaufman, JP Lithocholylcholine, a bile acid/acetylcholine hybrid, is a muscarinic receptor antagonist. J Pharmacol Exp Ther 303:29-35 (2002)  
Target
Name:
Muscarinic acetylcholine receptor M2
Synonyms:
ACM2_HUMAN Cholinergic, muscarinic M2 Muscarinic acetylcholine receptor M2 and M5 | RecName: Full=Muscarinic acetylcholine receptor M2
Type:
GPCR
Mol. Mass.:
51730.61
Organism:
Homo sapiens (Human)
Description:
P08172
Residue:
466
  
Inhibitor
Name:
BDBM10759
Synonyms:
2-acetoxyethyl(trimethyl)ammonium;bromide CHEMBL667 [2-(acetyloxy)ethyl]trimethylazanium acetylcholine chloride | cid_6060
Type:
Small Organic Molecule
Emp. Form.:
C7H16NO2
Mol. Mass.:
146.2069
SMILES:
CC(=O)OCC[N+](C)(C)C
: