Target
Alpha-1D adrenergic receptor
Ligand
BDBM84637
Substrate
Ki
>10000±n/a nM
Comments
PDSP_1575
Citation
 Millan, MJMaiofiss, LCussac, DAudinot, VBoutin, JANewman-Tancredi, A Differential actions of antiparkinson agents at multiple classes of monoaminergic receptor. I. A multivariate analysis of the binding profiles of 14 drugs at 21 native and cloned human receptor subtypes. J Pharmacol Exp Ther 303:791-804 (2002)  
Target
Name:
Alpha-1D adrenergic receptor
Synonyms:
ADA1D_HUMAN ADRA1D Adrenergic receptor alpha Alpha 1D-adrenoreceptor Alpha-1D adrenoceptor adrenergic Alpha1D
Type:
Enzyme Catalytic Domain
Mol. Mass.:
60485.82
Organism:
Homo sapiens (Human)
Description:
adrenergic Alpha1D ADRA1D HUMAN::P25100
Residue:
572
  
Inhibitor
Name:
BDBM84637
Synonyms:
CAS_85760-74-3 NSC_54562 Quinpirole,(-) | US9359372, Quinpirole
Type:
Small organic molecule
Emp. Form.:
C13H21N3
Mol. Mass.:
219.3259
SMILES:
CCCN1CCC[C@@H]2Cc3[nH]ncc3C[C@@H]12
: