Target
Hrh3 protein
Ligand
BDBM86061
Substrate
Ki
1.26±n/a nM
Comments
PDSP_2990
Citation
 Esbenshade, TAKrueger, KMMiller, TRKang, CHDenny, LIWitte, DGYao, BBFox, GBFaghih, RBennani, YLWilliams, MHancock, AA Two novel and selective nonimidazole histamine H3 receptor antagonists A-304121 and A-317920: I. In vitro pharmacological effects. J Pharmacol Exp Ther 305:887-96 (2003)  
Target
Name:
Hrh3 protein
Synonyms:
HISTAMINE H3 Hrh3 protein
Type:
Enzyme Catalytic Domain
Mol. Mass.:
37860.96
Organism:
RAT
Description:
Q5PPG3
Residue:
344
  
Inhibitor
Name:
BDBM86061
Synonyms:
A-304121
Type:
Small organic molecule
Emp. Form.:
C7H7N3O3
Mol. Mass.:
181.1488
SMILES:
CCn1c2nocc2c(=O)[nH]c1=O
: