Target
Histamine H3 receptor
Ligand
BDBM22541
Substrate
Ki
0.22±n/a nM
Comments
PDSP_539
Citation
 Esbenshade, TAKrueger, KMMiller, TRKang, CHDenny, LIWitte, DGYao, BBFox, GBFaghih, RBennani, YLWilliams, MHancock, AA Two novel and selective nonimidazole histamine H3 receptor antagonists A-304121 and A-317920: I. In vitro pharmacological effects. J Pharmacol Exp Ther 305:887-96 (2003)  
Target
Name:
Histamine H3 receptor
Synonyms:
HISTAMINE H3 HRH3_CAVPO | Histamine H3 receptor
Type:
Enzyme Catalytic Domain
Mol. Mass.:
48753.61
Organism:
GUINEA PIG
Description:
HISTAMINE H3 HRH3 GUINEA PIG::Q9JI35
Residue:
445
  
Inhibitor
Name:
BDBM22541
Synonyms:
Clobenpropit VUF 9153 VUF9153
Type:
Small organic molecule
Emp. Form.:
C14H17ClN4S
Mol. Mass.:
308.83
SMILES:
NC(SCCCc1cnc[nH]1)=NCc1ccc(Cl)cc1
: