Target
Transthyretin
Ligand
BDBM249549
Substrate
Meas. Tech.
Scintillation Proximity RBP4 Binding Assay
pH
7.4±n/a
Temperature
298.15±n/a K
IC50
25.5±n/a nM
Comments
extracted
Citation
 Petrukhin, KCioffi, CJohnson, GAllikmets, RFreeman, EChen, PConlon, MZhu, L Substituted 4-phenylpiperidines, their preparation and use US Patent  US10072016 Publication Date 9/11/2018 
Target
Name:
Transthyretin
Synonyms:
ATTR Prealbumin TTHY_HUMAN Transthyretin (TTR)
Type:
Enzyme
Mol. Mass.:
15884.31
Organism:
Homo sapiens (Human)
Description:
P02766
Residue:
147
  
Inhibitor
Name:
BDBM249549
Synonyms:
US10072016, Compound 147 US10913746, Compound 147 US9434727, 147 | US9777010, Compound 147
Type:
Small organic molecule
Emp. Form.:
C20H22ClFN4O3
Mol. Mass.:
420.865
SMILES:
COC(=O)N1CCc2c(C1)[nH]nc2C(=O)N1CCC(CC1)c1cccc(F)c1Cl
: