Target
Pro-FMRFamide-related neuropeptide FF
Ligand
BDBM86146
Substrate
Ki
11±n/a nM
Comments
PDSP_2997
Citation
 Engström, MBrandt, AWurster, SSavola, JMPanula, P Prolactin releasing peptide has high affinity and efficacy at neuropeptide FF2 receptors. J Pharmacol Exp Ther 305:825-32 (2003)  
Target
Name:
Pro-FMRFamide-related neuropeptide FF
Synonyms:
FMRFamide-related peptides Npff
Type:
Enzyme Catalytic Domain
Mol. Mass.:
13156.33
Organism:
RAT
Description:
NPFF 0 RAT::Q9WVA9
Residue:
114
  
Inhibitor
Name:
BDBM86146
Synonyms:
CAS_0 PrRP24-31
Type:
Small organic molecule
Emp. Form.:
C42H67N13O9
Mol. Mass.:
898.0631
SMILES:
[#6]-[#6](-[#6])-[#6]-[#6@H](-[#7]-[#6](=O)-[#6@H](-[#6]-[#6](-[#7])=O)-[#7]-[#6](=O)-[#6@@H]-1-[#6]-[#6]-[#6]-[#7]-1-[#6](=O)-[#6@@H](-[#7])-[#6](-[#6])-[#6])-[#6](=O)-[#7]-1-[#6]-[#6]-[#6]-[#6@H]-1-[#6](=O)-[#7]-[#6]-[#6](=O)-[#7]-[#6@@H](-[#6]-[#6]-[#6]\[#7]=[#6](/[#7])-[#7])-[#6](=O)-[#7]-[#6@@H](-[#6]-c1ccccc1)-[#6](-[#7])=O
: